hasBorderWith
type: ObjectProperty
source modified: 2010-05-01
source creator: United Nations cartographic maps
source: United Nations cartographic maps http://www.un.org/Depts/Cartographic/map/profile/world00.pdf
source identifier: http://www.un.org/Depts/Cartographic/map/profile/world00.pdf

isAdministeredBy
type: ObjectProperty
source modified: 2010-05-01
source creator: United Nations cartographic maps
source: United Nations cartographic maps http://www.un.org/Depts/Cartographic/map/profile/world00.pdf
source identifier: http://www.un.org/Depts/Cartographic/map/profile/world00.pdf

isPredecessorOf
type: ObjectProperty
source modified: 2010-04-15
source creator: United Nations Statistics Division
source: United Nations Statistics Division http://unstats.un.org/unsd/methods/m49/m49chang.htm
source identifier: http://unstats.un.org/unsd/methods/m49/m49chang.htm
source identifier: http://unstats.un.org/unsd/methods/m49/m49chgef.htm

isSuccessorOf
type: ObjectProperty
source modified: 2010-04-15
source creator: United Nations Statistics Division
source: United Nations Statistics Division http://unstats.un.org/unsd/methods/m49/m49chang.htm
source identifier: http://unstats.un.org/unsd/methods/m49/m49chang.htm
source identifier: http://unstats.un.org/unsd/methods/m49/m49chgef.htm

ERO_0000029
type: ObjectProperty
IAO_0000112: An access service that provides access to a flow cytometer.
IAO_0000115: Instruments, reagents, organisms, or software for which the service provides access.
IAO_0000117: PERSON: Melissa Haendel
IAO_0000119: PERSON: Melissa Haendel
comment: change the domain tye to access service
domain: ERO_0000005
IAO_0000114: IAO_0000120
range: Class
  union of: ERO_0000004
  union of: ERO_0000006
  union of: ERO_0000071
  union of: ERO_0001716

ERO_0000031
type: ObjectProperty
comment: Here there are things to be fixed (for instance a service can use a technique...)
IAO_0000112: Microsoft powerpoint is commonly used in research laboratories to prepare presentations.
IAO_0000117: PERSON: Melissa Haendel
IAO_0000119: PERSON: Melissa Haendel
IAO_0000115: Software or protocol used by the laboratory.
IAO_0000111: uses
inverse of: ERO_0000070
IAO_0000114: IAO_0000120
domain: Organization
range: Class
  union of: ERO_0000071
  union of: ERO_0001716
  union of: OBI_0000272

ERO_0000033
type: ObjectProperty
IAO_0000112: Brian Druker has expertise in cancer research.
IAO_0000117: PERSON: Melissa Haendel
IAO_0000119: PERSON: Melissa Haendel
IAO_0000115: Technique in which the person is proficient.
IAO_0000111: has expertise
range: ERO_0000007
IAO_0000114: IAO_0000120
domain: Person

ERO_0000034
type: ObjectProperty
IAO_0000115: Organization or person that created the resource.
IAO_0000119: PERSON: Melissa Haendel
IAO_0000117: PERSON: Melissa Haendel
IAO_0000112: Santa Cruz Biotechnology is the manufacturer of many antibodies.
IAO_0000111: has manufacturer
IAO_0000114: IAO_0000120
range: OBI_0000835
domain: Class
  union of: ERO_0000004
  union of: ERO_0000006
  union of: ERO_0000071
  union of: ERO_0001716

ERO_0000037
type: ObjectProperty
IAO_0000112: A core lab providing cell sorting to individual labs.
IAO_0000117: PERSON: Melissa Haendel
IAO_0000119: PERSON: Melissa Haendel
IAO_0000115: Service offered by the organization.
IAO_0000111: provides services
range: ERO_0000005
IAO_0000114: IAO_0000120
domain: Class
  union of: Organization
  union of: Person

ERO_0000038
type: ObjectProperty
IAO_0000112: A protocol can specify the use of a flow cytometer.
IAO_0000115: Instruments, techniques, reagents, organisms, or software that are referenced in a protocol.
IAO_0000117: PERSON: Melissa Haendel
IAO_0000119: PERSON: Melissa Haendel
IAO_0000111: specifies the use of
IAO_0000114: IAO_0000120
domain: OBI_0000272
range: Class
  union of: ERO_0000004
  union of: ERO_0000006
  union of: ERO_0000007
  union of: ERO_0000071

ERO_0000070
type: ObjectProperty
IAO_0000112: A laboratory uses Microsoft Word.
IAO_0000115: Laboratory that uses the protocol or software.
IAO_0000117: PERSON: Melissa Haendel
IAO_0000119: PERSON: Melissa Haendel
IAO_0000111: used by
IAO_0000114: IAO_0000120
range: Organization
domain: Class
  union of: ERO_0000071
  union of: ERO_0001716
  union of: OBI_0000272

ERO_0000076
type: ObjectProperty
IAO_0000112: Imaging processing software that requires .jpg format files for analysis.
IAO_0000117: PERSON: Carlo Torniai
IAO_0000119: PERSON: Melissa Haendel
IAO_0000115: Software data input format.
IAO_0000111: has input format
range: ERO_0001554
IAO_0000114: IAO_0000120
domain: Class
  union of: ERO_0000071
  union of: ERO_0001716

ERO_0000077
type: ObjectProperty
IAO_0000112: Microsoft Excel arranges and saves data in .xlsx format.
IAO_0000117: PERSON: Carlo Torniai
IAO_0000119: PERSON: Melissa Haendel
IAO_0000115: Software data output type.
IAO_0000111: has output format
domain: ERO_0000071
range: ERO_0001554
IAO_0000114: IAO_0000120

ERO_0000078
type: ObjectProperty
IAO_0000112: ImageJ software measures characteristics of digital images.
IAO_0000117: PERSON: Carlo Torniai
IAO_0000119: PERSON: Melissa Haendel
IAO_0000115: Transformation objective of the software.
IAO_0000111: achieves objective
domain: ERO_0000071
IAO_0000114: IAO_0000120
range: OBI_0200166

ERO_0000390
type: ObjectProperty
IAO_0000112: A core laboratory provides a service.
IAO_0000115: Organization or laboratory performing the service.
IAO_0000119: PERSON: Melissa Haendel
IAO_0000117: PERSON: Melissa Haendel
IAO_0000111: service provided by
domain: ERO_0000005
inverse of: ERO_0000037
IAO_0000114: IAO_0000120
range: Class
  union of: Organization
  union of: Person

ERO_0000397
type: ObjectProperty
IAO_0000112: A cancer researcher performs apoptosis assays.
IAO_0000117: PERSON: Melissa Haendel
IAO_0000119: PERSON: Melissa Haendel
IAO_0000115: Technique carried out by the person or laboratory.
range: ERO_0000007
IAO_0000114: IAO_0000120
domain: Class
  union of: Laboratory
  union of: Person

ERO_0000398
type: ObjectProperty
IAO_0000112: Confocal microscopy is performed by a confocal core laboratory.
IAO_0000117: PERSON: Melissa Haendel
IAO_0000119: PERSON: Melissa Haendel
IAO_0000115: Person or laboratory that performs the service or technique.
IAO_0000111: is performed by
domain: ERO_0000007
inverse of: ERO_0000397
IAO_0000114: IAO_0000120
range: Class
  union of: Laboratory
  union of: Person

ERO_0000460
type: ObjectProperty
IAO_0000112: An antibody has documentation describing attributes of the antibody.
IAO_0000115: Document that contains relevant resource information.
IAO_0000119: PERSON: Melissa Haendel
IAO_0000117: PERSON: Melissa Haendel
IAO_0000111: has documentation
IAO_0000114: IAO_0000120
range: Document
domain: Class
  union of: ERO_0000004
  union of: ERO_0000005
  union of: ERO_0000006
  union of: ERO_0000014
  union of: ERO_0000020
  union of: ERO_0000071
  union of: ERO_0001716
  union of: OBI_0000272

ERO_0000481
type: ObjectProperty
IAO_0000112: A sequencing protocol used for next generation sequencing.
IAO_0000117: PERSON: Melissa Haendel
IAO_0000119: PERSON: Melissa Haendel
IAO_0000115: Protocol used to perform the service.
comment: placeholder: need to be modeled for the proper kind of service (production services)
IAO_0000111: realizes protocol
IAO_0000114: IAO_0000120
range: OBI_0000272
domain: Class
  union of: ERO_0000005
  union of: ERO_0000014

ERO_0000482
type: ObjectProperty
IAO_0000117: PERSON: Melissa Haendel
IAO_0000119: PERSON: Melissa Haendel
comment: Placeholder needs to be redesign
IAO_0000112: Sequence analysis software.
IAO_0000115: Software used to perform the service.
deprecated: true
IAO_0000111: uses software
domain: ERO_0000005
range: ERO_0000071
IAO_0000114: IAO_0000120
sub property of: DeprecatedProperty

ERO_0000543
type: ObjectProperty
IAO_0000112: Flow cytometry is a related technique for a flow cytometer instrument.
IAO_0000115: Method in which the resource can be used.
IAO_0000117: PERSON: Melissa Haendel
IAO_0000119: PERSON: Melissa Haendel
IAO_0000111: related technique
range: ERO_0000007
IAO_0000114: IAO_0000120

ERO_0000572
type: ObjectProperty
IAO_0000112: A study of hibernation in bears.
IAO_0000115: Biological process studied in the organism.
IAO_0000119: PERSON: Melissa Haendel
IAO_0000117: PERSON: Melissa Haendel
IAO_0000111: used to study
IAO_0000114: IAO_0000120

ERO_0000775
type: ObjectProperty
IAO_0000112: A research opportunity requires applicants to be US citizens.
IAO_0000117: PERSON: Melissa Haendel
IAO_0000119: PERSON: Melissa Haendel
IAO_0000115: US residency status of applicants that may apply for the student research opportunity.
IAO_0000111: has residency requirement
domain: ERO_0000595
range: ERO_0000776
IAO_0000114: IAO_0000120

ERO_0000918
type: ObjectProperty
IAO_0000112: A research project studying breast cancer.
IAO_0000119: PERSON: Melissa Haendel
IAO_0000117: PERSON: Melissa Haendel
IAO_0000115: Research project during which the biological specimen was collected.
IAO_0000111: related research project
range: ERO_0000014
domain: ERO_0000020
inverse of: ERO_0000919
IAO_0000114: IAO_0000120

ERO_0000919
type: ObjectProperty
IAO_0000112: A breast cancer specimen.
IAO_0000115: Biological specimen collected as part of the research project.
IAO_0000119: PERSON: Melissa Haendel
IAO_0000117: PERSON: Melissa Haendel
IAO_0000111: related biological specimen
domain: ERO_0000014
range: ERO_0000020
IAO_0000114: IAO_0000120

ERO_0001057
type: ObjectProperty
IAO_0000117: PERSON: Melissa Haendel
IAO_0000119: PERSON: Melissa Haendel
IAO_0000112: Paraffin embedding of tissue.
IAO_0000115: Technique used to prepare the biological specimen.
IAO_0000111: has preparation technique
domain: ERO_0000020
sub property of: ERO_0000543
range: ERO_0001707
IAO_0000114: IAO_0000120

ERO_0001518
type: ObjectProperty
IAO_0000119: PERSON: Melissa Haendel
IAO_0000117: PERSON: Melissa Haendel
IAO_0000112: Phase 1 clinical trial.
IAO_0000115: Phase of a clinical trial to evaluate risk and to clinically evaluate the efficacy of drugs or biologicals.
IAO_0000111: has phase
domain: ERO_0000016
IAO_0000114: IAO_0000120
range: OCRE100038

ERO_0001520
type: ObjectProperty
IAO_0000115: Human study performed by the organization.
IAO_0000119: PERSON: Melissa Haendel
IAO_0000117: PERSON: Melissa Haendel
IAO_0000112: The Jackson Heart Institute performs human studies on heart disease.
IAO_0000111: performs human study
range: ERO_0000015
inverse of: ERO_0001521
IAO_0000114: IAO_0000120
domain: Organization

ERO_0001521
type: ObjectProperty
IAO_0000112: Jackson State University performs human studies on heart disease.
IAO_0000115: Organization that performs the human study.
IAO_0000117: PERSON: Melissa Haendel
IAO_0000119: PERSON: Melissa Haendel
IAO_0000111: human study performed by
domain: ERO_0000015
IAO_0000114: IAO_0000120
sub property of: has agent
range: Organization

ERO_0001824
type: ObjectProperty
IAO_0000115: Is a legal instrument (usually by way of contract law) governing the usage or redistribution of software.
IAO_0000117: PERSON: Scott Hoffmann
IAO_0000119: http://en.wikipedia.org/wiki/Software_license
domain: ERO_0000071
range: SWO_0000002

ERO_0001908
type: ObjectProperty
comment: Links an objective to a software operation whise execution achieves the objective. Is different from OBI:objective_achieved_by which links an objective to the process that achieves it.
IAO_0000117: PERSON:Matthew Brush
IAO_0000119: PERSON:Matthew Brush
IAO_0000115: a relation between a software objective (data transformation objective) and an operation whose execution in a software tool achieves the objective
IAO_0000116: software relation expanding to something like: objective_achieved_by some ('software/algorithm execution' and (specified_by some 'data processing operation'))
range: ERO_0100287
domain: OBI_0200166

IAO_0000136
type: ObjectProperty
IAO_0000116: 7/6/2009 Alan Ruttenberg. Following discussion with Jonathan Rees, and introduction of "mentions" relation. Weaken the is_about relationship to be primitive. We will try to build it back up by elaborating the various subproperties that are more precisely defined. Some currently missing phenomena that should be considered "about" are predications - "The only person who knows the answer is sitting beside me" , Allegory, Satire, and other literary forms that can be topical without explicitly mentioning the topic.
IAO_0000119: Smith, Ceusters, Ruttenberg, 2000 years of philosophy
IAO_0000112: This document is about information artifacts and their representations
IAO_0000115: is_about is a (currently) primitive relation that relates an information artifact to an entity.
IAO_0000117: person:Alan Ruttenberg
domain: IAO_0000030
IAO_0000114: IAO_0000125

IAO_0000221
type: ObjectProperty
IAO_0000116: 8/6/2009 Alan Ruttenberg: The strategy is to be rather specific with this relationship. There are other kinds of measurements that are not of qualities, such as those that measure time. We will add these as separate properties for the moment and see about generalizing later
IAO_0000117: Alan Ruttenberg
IAO_0000116: From the second IAO workshop [Alan Ruttenberg 8/6/2009: not completely current, though bringing in comparison is probably important] This one is the one we are struggling with at the moment. The issue is what a measurement measures. On the one hand saying that it measures the quality would include it "measuring" the bearer = referring to the bearer in the measurement. However this makes comparisons of two different things not possible. On the other hand not having it inhere in the bearer, on the face of it, breaks the audit trail. Werner suggests a solution based on "Magnitudes" a proposal for which we are awaiting details. -- From the second IAO workshop, various comments, [commented on by Alan Ruttenberg 8/6/2009] unit of measure is a quality, e.g. the length of a ruler. [We decided to hedge on what units of measure are, instead talking about measurement unit labels, which are the information content entities that are about whatever measurement units are. For IAO we need that information entity in any case. See the term measurement unit label] [Some struggling with the various subflavors of is_about. We subsequently removed the relation represents, and describes until and only when we have a better theory] a represents b means either a denotes b or a describes describe: a describes b means a is about b and a allows an inference of at least one quality of b We have had a long discussion about denotes versus describes.
IAO_0000116: From the second IAO workshop: An attempt at tieing the quality to the measurement datum more carefully. a is a magnitude means a is a determinate quality particular inhering in some bearer b existing at a time t that can be represented/denoted by an information content entity e that has parts denoting a unit of measure, a number, and b. The unit of measure is an instance of the determinable quality.
IAO_0000116: From the second meeting on IAO: An attempt at defining assay using Barry's "reliability" wording assay: process and has_input some material entity and has_output some information content entity and which is such that instances of this process type reliably generate outputs that describes the input.
IAO_0000116: This one is the one we are struggling with at the moment. The issue is what a measurement measures. On the one hand saying that it measures the quality would include it "measuring" the bearer = referring to the bearer in the measurement. However this makes comparisons of two different things not possible. On the other hand not having it inhere in the bearer, on the face of it, breaks the audit trail. Werner suggests a solution based on "Magnitudes" a proposal for which we are awaiting details.
IAO_0000115: m is a quality measurement of q at t when q is a quality there is a measurement process p that has specified output m, a measurement datum, that is about q
range: BFO_0000019
domain: IAO_0000109
sub property of: IAO_0000136

IAO_0000417
type: ObjectProperty
IAO_0000116: 2009/10/19 Alan Ruttenberg. Named 'junk' relation useful in restrictions, but not a real instance relationship
IAO_0000117: Person:Alan Ruttenberg
IAO_0000115: inverse of the relation of is quality measurement of
IAO_0000114: IAO_0000120
inverse of: IAO_0000221

OBI_0000293
type: ObjectProperty
IAO_0000116: 8/17/09: specified inputs of one process are not necessarily specified inputs of a larger process that it is part of. This is in contrast to how 'has participant' works.
IAO_0000117: PERSON: Bjoern Peters
IAO_0000117: PERSON: Larry Hunter
IAO_0000117: PERSON: Melanie Coutot
IAO_0000111: has_specified_input
IAO_0000115: A relation between a planned process and a continuant participating in that process that is not created during the process. The presence of the continuant during the process is explicitly specified in the plan specification which the process realizes the concretization of.
IAO_0000117: PERSON: Alan Ruttenberg
IAO_0000112: see is_input_of example_of_usage
domain: OBI_0000011
sub property of: RO_0002233

OBI_0000299
type: ObjectProperty
IAO_0000117: PERSON: Bjoern Peters
IAO_0000117: PERSON: Larry Hunter
IAO_0000117: PERSON: Melanie Courtot
IAO_0000111: has_specified_output
IAO_0000115: A relation between a planned process and a continuant participating in that process. The presence of the continuant at the end of the process is explicitly specified in the objective specification which the process realizes the concretization of.
IAO_0000117: PERSON: Alan Ruttenberg
domain: OBI_0000011
inverse of: OBI_0000312
sub property of: RO_0002234

OBI_0000304
type: ObjectProperty
IAO_0000117: Alan Ruttenberg
IAO_0000117: Liju Fan
IAO_0000115: c is_manufactured_by o means that there was a process p in which c was built in which a person, or set of people or machines did the work(bore the "Manufacturer Role", and those people/and or machines were members or of directed by the organization to do this.
IAO_0000118: has_make
IAO_0000118: has_manufacturer
IAO_0000112: http://www.affymetrix.com/products/arrays/specific/hgu133.affx is_manufactered_by http://www.affymetrix.com/ (if we decide to use these URIs for the actual entities)
IAO_0000111: is_manufactured_by
domain: BFO_0000040
range: Organization

OBI_0000312
type: ObjectProperty
IAO_0000117: PERSON:Bjoern Peters
IAO_0000111: is_specified_output_of
IAO_0000115: A relation between a planned process and a continuant participating in that process. The presence of the continuant at the end of the process is explicitly specified in the objective specification which the process realizes the concretization of.
IAO_0000117: Alan Ruttenberg
range: OBI_0000011
sub property of: RO_0002353

OBI_0000417
type: ObjectProperty
IAO_0000112: A cell sorting process achieves the objective specification 'material separation objective'
IAO_0000117: BP, AR, PPPB branch
IAO_0000119: PPPB branch derived
IAO_0000115: This relation obtains between a planned process and a objective specification when the criteria specified in the objective specification are met at the end of the planned process.
IAO_0000232: modified according to email thread from 1/23/09 in accordince with DT and PPPB branch
range: IAO_0000005
domain: OBI_0000011

OBI_0000643
type: ObjectProperty
IAO_0000119: PAPER: Granularity, scale and collectivity: When size does and does not matter, Alan Rector, Jeremy Rogers, Thomas Bittner, Journal of Biomedical Informatics 39 (2006) 333-349
IAO_0000111: has grain
IAO_0000115: the relation of the cells in the finger of the skin to the finger, in which an indeterminate number of grains are parts of the whole by virtue of being grains in a collective that is part of the whole, and in which removing one granular part does not nec- essarily damage or diminish the whole. Ontological Whether there is a fixed, or nearly fixed number of parts - e.g. fingers of the hand, chambers of the heart, or wheels of a car - such that there can be a notion of a single one being missing, or whether, by contrast, the number of parts is indeterminate - e.g., cells in the skin of the hand, red cells in blood, or rubber molecules in the tread of the tire of the wheel of the car.
IAO_0000116: Discussion in Karslruhe with, among others, Alan Rector, Stefan Schulz, Marijke Keet, Melanie Courtot, and Alan Ruttenberg. Definition take from the definition of granular parthood in the cited paper. Needs work to put into standard form
IAO_0000117: PERSON: Alan Ruttenberg
sub property of: BFO_0000051
IAO_0000412: obi webservice.owl

OBI_0000833
type: ObjectProperty
IAO_0000115: This relation obtains between a a objective specification and a planned process when the criteria specified in the objective specification are met at the end of the planned process.
IAO_0000116: definition needs clean up to indicate directionality
domain: IAO_0000005
range: OBI_0000011
inverse of: OBI_0000417

RO_0000052
type: ObjectProperty
type: FunctionalProperty
IAO_0000116: This clarifies that only specifically dependent continuants inhere in (specifically) one independent continuant over all time. For GDCs, there in implicitly inherence to all the independent continuants in which the concretizations inhere. Should add a 'cardinality 1' restriction to the definition of specifically dependent continuant.
IAO_0000116: This relation belongs in BFO/RO, and will be in BFO 2
range: BFO_0000004
domain: BFO_0000020
inverse of: RO_0000053

RO_0003000
type: ObjectProperty
IAO_0000117: Melissa Haendel
IAO_0000115: a produces b if some process that occurs_in a has_output b, where a and b are material entities. Examples: hybridoma cell line produces monoclonal antibody reagent; chondroblast produces avascular GAG-rich matrix.
domain: BFO_0000040
range: BFO_0000040
IAO_0000412: ro.owl

affirmedBy
type: ObjectProperty
IAO_0000112: The public description was taken from here: http://bibotools.googlecode.com/svn/bibo-ontology/trunk/doc/index.html
comment: A legal decision that affirms a ruling.

annotates
type: ObjectProperty
IAO_0000112: The public description source is: http://bibotools.googlecode.com/svn/bibo-ontology/trunk/doc/index.html.
term status: stable
comment: Critical or explanatory note for a Document.

court
type: ObjectProperty
IAO_0000112: Public description take from: http://bibotools.googlecode.com/svn/bibo-ontology/trunk/doc/index.html. Bibo considers this property "unstable".
term status: unstable
comment: A court associated with a legal document; for example, that which issues a decision.

degree
type: ObjectProperty
IAO_0000112: The source of the public description and this info is found here: http://bibotools.googlecode.com/svn/bibo-ontology/trunk/doc/index.html. Bibo considers this term "unstable". The bibo editorial note is: "We are not defining, using an enumeration, the range of the bibo:degree to the defined list of bibo:ThesisDegree. We won't do it because we want people to be able to define new degress if needed by some special usecases. Creating such an enumeration would restrict this to happen."
comment: The thesis degree.
editorial note: We are not defining, using an enumeration, the range of the bibo:degree to the defined list of bibo:ThesisDegree. We won't do it because we want people to be able to define new degress if needed by some special usecases. Creating such an enumeration would restrict this to happen.
term status: unstable

director
type: ObjectProperty
IAO_0000112: Definition take from this site: http://bibotools.googlecode.com/svn/bibo-ontology/trunk/doc/index.html .
comment: A Film director.
term status: stable

interviewee
type: ObjectProperty
term status: stable
comment: An agent that is interviewed by another agent.

interviewer
type: ObjectProperty
term status: stable
comment: An agent that interview another agent.

performer
type: ObjectProperty
term status: stable

presents
type: ObjectProperty
IAO_0000112: Public Description from source: http://bibotools.googlecode.com/svn/bibo-ontology/trunk/doc/index.html . Bibo considers the bibo:presents and the bibo:presentedAt unstable terms. It also indicates that bibo:presents is a sub-property of event:product.
comment: Relates an event to associated documents; for example, conference to a paper.
term status: unstable

recipient
type: ObjectProperty
term status: stable
comment: An agent that receives a communication document.

reversedBy
type: ObjectProperty
IAO_0000112: The first sentence of the public description was taken from here: http://bibotools.googlecode.com/svn/bibo-ontology/trunk/doc/index.html
comment: A legal decision that reverses a ruling.

reviewOf
type: ObjectProperty
IAO_0000112: The bibo:reviewOf public description was found here: http://bibotools.googlecode.com/svn/bibo-ontology/trunk/doc/index.html . As of 26 May 2010, bibo:reviewOf is used with the class Review, but core:reviewIn doesn't seem to be being used.

status
type: ObjectProperty
IAO_0000112: paraphrased editorial note from the bibo ontology: We are not defining, using an enumeration, the range of the bibo:status to be a defined list of bibo:DocumentStatus. This is because we want people to be able to define new statuses if needed; and creating such an enumeration would prevent this.

subsequentLegalDecision
type: ObjectProperty
IAO_0000112: Public description is from comments of this object property in bibo ontology located here: http://bibotools.googlecode.com/svn/bibo-ontology/trunk/doc/index.html
comment: A legal decision on appeal that takes action on a case (affirming it, reversing it, etc.).

transcriptOf
type: ObjectProperty
IAO_0000112: The bibo:transcriptOf public description was found here: http://bibotools.googlecode.com/svn/bibo-ontology/trunk/doc/index.html . Bibo considers this term unstable.
comment: Relates a document to some transcribed original.
term status: unstable

translationOf
type: ObjectProperty
IAO_0000112: Examples shows a book has French language version. Public description source: http://bibotools.googlecode.com/svn/bibo-ontology/trunk/doc/index.html .
comment: Relates a translated document to the original document.
term status: stable

hasGlobalCitationFrequency
type: ObjectProperty
IAO_0000115: A property linking a publication entity to an instance of c40:GlobalCitationCount that specifies how many times a work has been cited by others, according to a particular information source on a particular date.

hasGlobalCountSource
type: ObjectProperty
IAO_0000115: A property linking an instance of c40:GlobalCitationCount to the bibliographic information source providing the global citation count information for a particular publication on a particular date.

assignedBy
type: ObjectProperty
IAO_0000115: Relates a Relationship (as a predicate or n-ary relation over one or more Thing) to an Agent that defined or instantiated the predicate instance.

features
type: ObjectProperty
IAO_0000112: This is done through a restriction on the foaf:Person class.

hasTranslation
type: ObjectProperty
IAO_0000112: Examples shows a book has French language version. Public description source: http://bibotools.googlecode.com/svn/bibo-ontology/trunk/doc/index.html .

providesFundingThrough
type: ObjectProperty
IAO_0000112: For example, National Science Foundation providesFundingThrough Graduate Research Fellowship Program; National Institutes of Health providesFundingThrough National Center for Research Resources.
domain: FundingOrganization
range: FundingOrganization

publisher
type: ObjectProperty
IAO_0000112: Public Definition source (http://www.answers.com/topic/publisher).
range: Organization

publisherOf
type: ObjectProperty
IAO_0000112: Public Definition source (http://www.answers.com/topic/publisher).
domain: Organization
range: IAO_0000030

relatedBy
type: ObjectProperty
IAO_0000115: Relates a Thing to a Relationship as a Thing that is somehow related to other Thing in the same Relationship instance. A Relationship instnace is a predicate over Thing and is created by an Agent.

relates
type: ObjectProperty
IAO_0000115: Relates a Relationship instance to the one or more Thing of the Relationship. There is a separate property (assigned by) to relate to the Agent that defines the Relationship.
inverse of: relatedBy

broader
type: ObjectProperty
IAO_0000115: Public description modified from the information on this page: http://www.w3.org/TR/2005/WD-swbp-skos-core-guide-20050510/#sechierarchy .

narrower
type: ObjectProperty
IAO_0000115: Public description modified from the information on this page: http://www.w3.org/TR/2005/WD-swbp-skos-core-guide-20050510/#sechierarchy .

hasMember
type: ObjectProperty
comment: To include a member in the group this vCard represents
domain: Group
range: Class
  union of: Individual
  union of: Location
  union of: Organization

orcidId
type: ObjectProperty
IAO_0000112: This is now an object property where the object value is a resource of the form <http://orcid.org/NNNN-NNNN-NNNN-NNNN>. This is to support connecting VIVO and ORCID in the linked data web. Note: a person can have multiple ORCID iDs.
domain: Person