Film
type: Class
short def: Audiovisual recording in film format
subclass of: AudioVisualDocument
term status: stable
comment: aka movie.

AudioVisualDocument
type: Class
term status: stable
subclass of: Document
comment: An audio-visual document; film, video, and so forth.
subclass of: Restriction
  all values from: Organization
  on property: distributor
short def: Audiovisual recording in any format
example annot: film; video; Blu-ray

Chapter
type: Class
short def: A main division of a book
comment: A chapter of a book.
subclass of: BookSection
term status: unstable

BookSection
type: Class
subclass of: Restriction
  all values from: Literal
  on property: edition
subclass of: Restriction
  all values from: Literal
  on property: pageStart
description annot: Short Definition from the bibo ontology
term status: unstable
short def: A section of a book
subclass of: DocumentPart
subclass of: Restriction
  all values from: Literal
  on property: pageEnd
comment: A section of a book.

Excerpt
type: Class
comment: A passage selected from a larger work.
subclass of: DocumentPart
short def: A passage selected from a larger work
term status: stable
description annot: Short Definition from the bibo ontology

DocumentPart
type: Class
subclass of: Restriction
  all values from: Document
  on property: partOf
subclass of: Restriction
  all values from: Organization
  on property: publisher
description annot: Short Definition from the bibo ontology
short def: A distinct part of a larger document or collected document
subclass of: Document
comment: a distinct part of a larger document or collected document.
term status: unstable
subclass of: Restriction
  all values from: Literal
  on property: placeOfPublication

Periodical
type: Class
term status: stable
subclass of: Restriction
  all values from: Organization
  on property: publisher
comment: A group of related documents issued at regular intervals.
subclass of: Restriction
  all values from: Literal
  on property: issn
subclass of: Collection
subclass of: Restriction
  all values from: Literal
  on property: eissn

issn
type: DatatypeProperty
sub property of: identifier
comment: International Standard Serial Number
term status: stable
description annot: source: http://en.wikipedia.org/wiki/Issn

Collection
type: Class
comment: A collection of Documents or Collections
example annot: Hill Ornithology Collection; Wiley Interscience Online Books Biochemisty Collection
description annot: Collection of information resources that have a unified identity. Archives, museums and libraries often acquire collections on specific subjects and from distinguished authors or researchers. Also includes collections of resources bundled into a license.
subclass of: Restriction
  all values from: Literal
  on property: oclcnum
short def: Collection of information resources that have a unified identity
subclass of: InformationResource
term status: stable

eissn
type: DatatypeProperty
term status: stable
description annot: eissn stands for Electronic International Standard Serial Number. source: http://www.definition-of.com/EISSN
comment: The electronic ISSN number of a periodical.
sub property of: identifier

Code
type: Class
short def: A work consisting of texts of rules and regulations related to statutes issued by executive or administrative agencies
term status: stable
subclass of: Periodical
comment: A collection of statutes.
description annot: Short Definition from OCLC Input Standards, EntW
example annot: Code of Federal Regulations

Note
type: Class
short def: Notes or annotations about a resource
subclass of: Document
comment: Notes or annotations about a resource.
description annot: Short Definition from bibo ontology
term status: stable

Document
type: Class
short def: A bounded physical representation of a body of information designed with the capacity (and usually intent) to communicate
subclass of: InformationResource
description annot: Short Definition from the bibo ontology
term status: stable
subclass of: Restriction
  all values from: Literal
  on property: oclcnum
subclass of: Restriction
  all values from: DocumentPart
  on property: hasPart
subclass of: Restriction
  all values from: Literal
  on property: abstract
subclass of: Restriction
  all values from: GlobalCitationCount
  on property: hasGlobalCitationFrequency
subclass of: Restriction
  all values from: Agent
  on property: features
comment: A document (noun) is a bounded physical representation of body of information designed with the capacity (and usually intent) to communicate. A document may manifest symbolic, diagrammatic or sensory-representational information.

Report
type: Class
subclass of: Restriction
  all values from: Organization
  on property: distributor
term status: stable
subclass of: Document
short def: A document describing an account or statement describing in detail an event, situation, or the like, usually as the result of observation, inquiry, etc.
comment: A document describing an account or statement describing in detail an event, situation, or the like, usually as the result of observation, inquiry, etc..
description annot: Medical Subject Heading (MeSH) definition of Technical Report: Work consisting of a formal report giving details of the investigation and results of a medical or other scientific problem. When issued by a government agency or comparable official body, its contents may be classified, unclassified, or declassified with regard to security clearance. This publication type may also cover a scientific paper or article that records the current state or current position of scientific research and development. If so labeled by the editor or publisher, this publication type may be properly used for journal articles.

distributor
type: ObjectProperty
description annot: Public Description for bibo:distributor taken from here: http://bibotools.googlecode.com/svn/bibo-ontology/trunk/doc/index.html .
inverse of: distributes

Proceedings
type: Class
comment: A compilation of documents published from an event, such as a conference.
term status: unstable
description annot: Short Definition copied from bibo ontology
short def: A compilation of documents published from an event, such as a conference
subclass of: Book

Book
type: Class
subclass of: Restriction
  all values from: Organization
  on property: publisher
subclass of: Restriction
  all values from: Literal
  on property: lccn
subclass of: Restriction
  all values from: Literal
  on property: edition
subclass of: Restriction
  all values from: Literal
  on property: numPages
description annot: Short Definition copied from bibo ontology
subclass of: Document
comment: A written or printed work of fiction or nonfiction, usually on sheets of paper fastened or bound together within covers.
subclass of: Restriction
  all values from: Literal
  on property: placeOfPublication
short def: A written or printed work of fiction or nonfiction, usually on sheets of paper fastened or bound together within covers
term status: stable

Standard
type: Class
comment: A document describing a standard
term status: stable
short def: A specification giving a precise statement of a process or a service requirement, often sanctioned by a nation or industry
subclass of: Document
description annot: Short Definition from OCLC Input Standards, EntW

LegalDocument
type: Class
short def: a document that states some contractual relationship or grants some right
subclass of: Document
comment: A legal document; for example, a court decision, a brief, and so forth.
term status: stable

lccn
type: DatatypeProperty
description annot: Source: http://en.wikipedia.org/wiki/Library_of_Congress_Control_Number.
comment: Library of Congress Control Number
sub property of: identifier
term status: stable

edition
type: DatatypeProperty
domain: Document
term status: stable
comment: The name defining a special edition of a document. Normally its a literal value composed of a version number and words.

oclcnum
type: DatatypeProperty
term status: stable
description annot: http://info-uri.info/registry/OAIHandler?verb=GetRecord&metadataPrefix=reg&identifier=info:oclcnum/. bibo has the domain of this property set to the union of Collection and Document.
comment: OCLC Identifier
sub property of: identifier

DocumentStatus
type: Class
term status: stable
comment: The status of the publication of a document.
description annot: The status of a document with respect to its publication. The statuses are represented as individuals of this class. Use the "show all individuals of this class" button on the class control panel to see the currently defined statuses.
example annot: submitted; accepted; in-press; published; invited; refereed.
short def: The status of a document with respect to its publication.

Performance
type: Class
short def: Something carried out, acted or rendered.
term status: unstable
subclass of: Event
comment: A public performance.

Legislation
type: Class
comment: A legal document proposing or enacting a law or a group of laws.
subclass of: LegalDocument
short def: Enactments of legislative bodies, published in either statute or code form
term status: unstable
description annot: From OCLC Input Standards, EntW

Letter
type: Class
short def: A written or printed communication addressed to a person or organization and usually transmitted by mail
description annot: A written or printed communication addressed to a person or organization and usually transmitted by mail
subclass of: PersonalCommunicationDocument

PersonalCommunicationDocument
type: Class
subclass of: Document
description annot: A personal communication manifested in some document.
short def: A personal communication manifested in some document.

Webpage
type: Class
comment: A web page is an online document available (at least initially) on the world wide web. A web page is written first and foremost to appear on the web, as distinct from other online resources such as books, manuscripts or audio documents which use the web primarily as a distribution mechanism alongside other more traditional methods such as print.
term status: unstable
short def: One section of a website that appears at a unique address within the parent site's address or URL on the World Wide Web
subclass of: Document

AudioDocument
type: Class
term status: stable
short def: Recorded audio in any format
comment: An audio document; aka record.
example annot: phonograph record; tape; CD; DVD; DAT
subclass of: Document
subclass of: Restriction
  all values from: Organization
  on property: distributor

pageStart
type: DatatypeProperty
comment: Starting page number within a continuous page range.
sub property of: locator
type: FunctionalProperty
term status: stable

pageEnd
type: FunctionalProperty
comment: Ending page number within a continuous page range.
term status: stable
type: DatatypeProperty
sub property of: locator

LegalDecision
type: Class
term status: unstable
short def: The written determination of a case, motion or claim by a court or tribunal
comment: A document containing an authoritative determination (as a decree or judgment) made after consideration of facts or law.
subclass of: LegalCaseDocument

LegalCaseDocument
type: Class
subclass of: LegalDocument
comment: A document accompanying a legal case.
short def: Official court papers for a case
term status: unstable

Website
type: Class
subclass of: Collection
subclass of: Restriction
  all values from: Agent
  on property: publisher
short def: A group of webpages available within a specific parent address or URL on the World Wide Web
term status: unstable
comment: A group of Webpages accessible on the Web.
example annot: Facebook; VIVOweb.org; Flickr

Hearing
type: Class
short def: An instance or a session in which testimony and arguments are presented, esp. before an official, as a judge in a lawsuit.
description annot: Definiton from Bibo here: http://bibotools.googlecode.com/svn/bibo-ontology/trunk/doc/index.html
comment: An instance or a session in which testimony and arguments are presented, esp. before an official, as a judge in a lawsuit.
subclass of: Event
term status: stable

Brief
type: Class
term status: unstable
short def: A document stating the facts and points of law of a client's case
subclass of: LegalCaseDocument
comment: A written argument submitted to a court.

CollectedDocument
type: Class
term status: stable
comment: A document that simultaneously contains other documents.
description annot: Short Definition is the Medical Subject Heading (MeSH) definition
subclass of: Restriction
  all values from: Organization
  on property: publisher
short def: Work consisting of collections of previously published works
subclass of: Document

Interview
type: Class
term status: stable
subclass of: Event
short def: A conversation between two or more people where questions are asked by the interviewer to obtain information from the interviewee.
comment: A formalized discussion between two or more people.
example annot: radio or newspaper interview

Issue
type: Class
term status: stable
short def: something that is printed or published and distributed, esp. a given number of a periodical
description annot: Short Definition from the bibo ontology
comment: something that is printed or published and distributed, esp. a given number of a periodical
subclass of: CollectedDocument

Patent
type: Class
description annot: A patent is an exclusive right granted for an invention, which is a product or a process that provides, in general, a new way of doing something, or offers a new technical solution to a problem. In order to be patentable, the invention must fulfill certain conditions. (http://www.wipo.int/patentscope/en/)
subclass of: Document
comment: A document describing the exclusive right granted by a government to an inventor to manufacture, use, or sell an invention for a certain number of years.
term status: stable
short def: (from BIBO) A document describing the exclusive right granted by a government to an inventor to manufacture, use, or sell an invention for a certain number of years
subclass of: Restriction
  all values from: Organization
  on property: publisher
subclass of: Restriction
  all values from: DateTimeValue
  on property: dateIssued

Quote
type: Class
description annot: Short Definition from the bibo ontology
comment: An excerpted collection of words.
term status: stable
subclass of: Excerpt
short def: An excerpted collection of words

Newspaper
type: Class
short def: Contains news articles, opinions, features, advertising, and is usually issued daily or weekly
comment: A periodical of documents, usually issued daily or weekly, containing current news, editorials, feature articles, and usually advertising.
example annot: USA Today
term status: stable
subclass of: Periodical

Journal
type: Class
subclass of: Restriction
  all values from: string
  on property: abbreviation
example annot: Journal of Information Science; IEEE Intelligent System; Scientometrics
short def: Contains original scholarly research or review articles by experts in the field
comment: A periodical of scholarly journal Articles.
term status: stable
description annot: Articles usually contain abstracts and bibliographies. Includes peer-reviewed, non-peer-reviewed, and open access journals. Journals are usually indexed in the major academic databases such as PubMed and Web of Science.
subclass of: Periodical

CourtReporter
type: Class
term status: stable
short def: Collection of legal cases
comment: A collection of legal cases.
subclass of: Periodical
example annot: Supreme Court Reporter

Magazine
type: Class
short def: Contains articles of current events or general interest, geared to the reading public as being informative or recreational
subclass of: Periodical
comment: A periodical of magazine Articles. A magazine is a publication that is issued periodically, usually bound in a paper cover, and typically contains essays, stories, poems, etc., by many writers, and often photographs and drawings, frequently specializing in a particular subject or area, as hobbies, news, or sports.
term status: stable
description annot: Abstracts and bibliographies are usually not included in magazines.
example annot: New Yorker

ThesisDegree
type: Class
short def: The academic degree of a Thesis.
comment: The academic degree of a Thesis
example annot: Doctor of Philosophy (Ph.D.)
description annot: Different from general academic degree, thesis degree is achieved through one's completed thesis. Thesis is a document submitted in support of candidature for a degree or professional qualification presenting the author's research and findings(http://en.wikipedia.org/wiki/Thesis_or_dissertation).
subclass of: AcademicDegree
term status: stable

Image
type: Class
subclass of: InformationResource
example annot: photograph; diagram
term status: stable
comment: A document that presents visual or diagrammatic information.
subclass of: Document
short def: A visual representation such as a photograph or graph

Series
type: Class
example annot: Methods in Molecular Biology
subclass of: Collection
short def: A thematic collection of documents, usually books, issued at regular or irregular intervals
comment: A loose, thematic, collection of Documents, often Books.
subclass of: Restriction
  all values from: Literal
  on property: issn
subclass of: Restriction
  all values from: Literal
  on property: eissn
term status: stable

Thesis
type: Class
short def: Works created to satisfy the requirements for an academic certification or degree; also called dissertation
term status: stable
comment: A document created to summarize research findings associated with the completion of an academic degree.
description annot: Short Definition from OCLC Input Standards, EntW
subclass of: Document
subclass of: Restriction
  all values from: Literal
  on property: abbreviation
subclass of: Restriction
  all values from: Literal
  on property: placeOfPublication

abstract
type: DatatypeProperty
comment: A summary of the resource.
term status: stable
sub property of: description
description annot: http://bibotools.googlecode.com/svn/bibo-ontology/trunk/doc/index.html

Slideshow
type: Class
comment: A presentation of a series of slides, usually presented in front of an audience with written text and images.
term status: stable
description annot: Short Definition from the bibo ontology
subclass of: Document
short def: A presentation of a series of slides, usually presented in front of an audience with written text and images

Bill
type: Class
term status: stable
comment: Draft legislation presented for discussion to a legal body.
subclass of: Legislation
short def: Draft legislation presented for discussion to a legal body
description annot: Short Definition from the bibo ontology

AcademicArticle
type: Class
example annot: A specific academic journal article
short def: Written by scholars for other scholars, typically published in an academic journal with an abstract and bibliography
comment: A scholarly academic article, typically published in a journal.
subclass of: Article
subclass of: Restriction
  all values from: Literal
  on property: eanucc13
subclass of: Restriction
  all values from: Journal
  on property: hasPublicationVenue
term status: stable

Article
type: Class
subclass of: Restriction
  all values from: Literal
  on property: doi
subclass of: Document
example annot: A specific journal article
short def: A written composition in prose, usually nonfiction, on a specific topic, forming an independent part of a periodical or book
subclass of: Restriction
  all values from: Literal
  on property: pageStart
description annot: Short Definition modified from the bibo ontology.
comment: A written composition in prose, usually nonfiction, on a specific topic, forming an independent part of a book or other publication, as a newspaper or magazine.
subclass of: Restriction
  all values from: Literal
  on property: pageEnd
term status: stable

eanucc13
type: DatatypeProperty
description annot: Definition source: http://en.wikipedia.org/wiki/European_Article_Numbering-Uniform_Code_Council. The Uniform Code Council (UCC) was the Numbering Organization in the USA to administer and manage the EAN.UCC System. In 2005 the UCC changed its name to GS1 US.
term status: stable
comment: European Article Number/Uniform Commercier Code 13
sub property of: identifier

ReferenceSource
type: Class
term status: unstable
comment: A document that presents authoritative reference information, such as a dictionary or encylopedia .
short def: A document that presents authoritative reference information, such as a dictionary or encylopedia
subclass of: Document
description annot: Short Definition from the bibo ontology

Manual
type: Class
example annot: SDB User Manual
short def: A book of instructions or guide to a specific topic
term status: unstable
comment: A small reference book, especially one giving instructions.
subclass of: Document

Workshop
type: Class
short def: Bibo Definition: A seminar, discussion group, or the like, that emphasizes exchange of ideas and the demonstration and application of techniques, skills, etc.
subclass of: Event
term status: stable
comment: A seminar, discussion group, or the like, that emphasizes zxchange of ideas and the demonstration and application of techniques, skills, etc.

EditedBook
type: Class
comment: An edited book.
subclass of: Restriction
  all values from: Organization
  on property: publisher
example annot: Best American Science Writing 2009
subclass of: CollectedDocument
term status: stable
short def: An edited collection of stand-alone articles published as a book
subclass of: Restriction
  all values from: Literal
  on property: edition
subclass of: Restriction
  all values from: Literal
  on property: placeOfPublication

Map
type: Class
description annot: The Short Definition is how the bibo ontology defines Map. It has been extended to include more broader concept of map which includes science maps, social network maps.
comment: A graphical depiction of geographic features.
short def: A graphical depiction of geographic features, scientific discipline, scientific data analytical results
subclass of: Image
term status: unstable

Slide
type: Class
description annot: Short Definition from the bibo ontology
subclass of: DocumentPart
short def: A slide in a slideshow
comment: A slide in a slideshow
term status: unstable

doi
type: DatatypeProperty
sub property of: identifier
term status: stable
comment: Digital Object Identifier

Conference
type: Class
comment: A meeting for consultation or discussion.
subclass of: Event
description annot: core:Seminar and bibo:Conference are very similar.
example annot: 2010 International Congress on Autoimmunity; American Libraries Association 2009
short def: A meeting for consultation or discussion.
subclass of: Restriction
  all values from: Literal
  on property: abbreviation
term status: stable

Manuscript
type: Class
short def: Works prepared by hand including handwritten or typescript drafts of pre-publication papers or works not otherwise reproduced in multiple copies
comment: An unpublished Document, which may also be submitted to a publisher for publication.
description annot: Short Definition is the Medical Subject Heading (MeSH) definition
term status: stable
subclass of: Document

Statute
type: Class
comment: A bill enacted into law.
subclass of: Legislation
short def: A bill enacted into law
term status: stable
description annot: Short Definition from bibo ontology

degree
type: ObjectProperty
description annot: The source of the public description and this info is found here: http://bibotools.googlecode.com/svn/bibo-ontology/trunk/doc/index.html. Bibo considers this term "unstable". The bibo editorial note is: "We are not defining, using an enumeration, the range of the bibo:degree to the defined list of bibo:ThesisDegree. We won't do it because we want people to be able to define new degress if needed by some special usecases. Creating such an enumeration would restrict this to happen."
term status: unstable
editorial note: We are not defining, using an enumeration, the range of the bibo:degree to the defined list of bibo:ThesisDegree. We won't do it because we want people to be able to define new degress if needed by some special usecases. Creating such an enumeration would restrict this to happen.
range: ThesisDegree
comment: The thesis degree.
domain: Thesis

presents
type: ObjectProperty
description annot: Public Description from source: http://bibotools.googlecode.com/svn/bibo-ontology/trunk/doc/index.html . Bibo considers the bibo:presents and the bibo:presentedAt unstable terms. It also indicates that bibo:presents is a sub-property of event:product.
inverse of: presentedAt
sub property of: product
comment: Relates an event to associated documents; for example, conference to a paper.
term status: unstable
range: Document
domain: Event

presentedAt
type: ObjectProperty
term status: unstable
range: Event
inverse of: presents
sub property of: produced in
description annot: Public Description from source: http://bibotools.googlecode.com/svn/bibo-ontology/trunk/doc/index.html . Bibo considers the bibo:presents and the bibo:presentedAt unstable terms. It also indicates that bibo:presents is a sub-property of event:product.
domain: Document
comment: Relates a document to an event; for example, a paper to a conference.

director
type: ObjectProperty
term status: stable
description annot: Definition take from this site: http://bibotools.googlecode.com/svn/bibo-ontology/trunk/doc/index.html .
comment: A Film director.
sub property of: contributor
range: Agent

affirmedBy
type: ObjectProperty
comment: A legal decision that affirms a ruling.
description annot: The public description was taken from here: http://bibotools.googlecode.com/svn/bibo-ontology/trunk/doc/index.html
range: LegalDecision
domain: LegalDecision
sub property of: subsequentLegalDecision

subsequentLegalDecision
type: ObjectProperty
comment: A legal decision on appeal that takes action on a case (affirming it, reversing it, etc.).
domain: LegalDecision
description annot: Public description is from comments of this object property in bibo ontology located here: http://bibotools.googlecode.com/svn/bibo-ontology/trunk/doc/index.html
sub property of: isReferencedBy
range: LegalDecision

performer
type: ObjectProperty
term status: stable
sub property of: contributor
domain: Performance
range: Agent

annotates
type: ObjectProperty
sub property of: relation
comment: Critical or explanatory note for a Document.
description annot: The public description source is: http://bibotools.googlecode.com/svn/bibo-ontology/trunk/doc/index.html.
term status: stable
domain: Note

issuer
type: ObjectProperty
description annot: An entity responsible for issuing often informally published documents such as press releases, reports, etc. This term is classified as unstable by bibo.
comment: An entity responsible for issuing often informally published documents such as press releases, reports, etc.
sub property of: publisher
term status: unstable
range: Agent

editor
type: ObjectProperty
sub property of: contributor
description annot: Definition from bibo: A person having managerial and sometimes policy-making responsibility for the editorial part of a publishing firm or of a newspaper, magazine, or other publication.
domain: InformationResource
range: Person

reversedBy
type: ObjectProperty
comment: A legal decision that reverses a ruling.
description annot: The first sentence of the public description was taken from here: http://bibotools.googlecode.com/svn/bibo-ontology/trunk/doc/index.html
range: LegalDecision
sub property of: subsequentLegalDecision
domain: LegalDecision

recipient
type: ObjectProperty
range: Agent
comment: An agent that receives a communication document.
term status: stable
sub property of: contributor

interviewee
type: ObjectProperty
sub property of: contributor
range: Agent
term status: stable
comment: An agent that is interviewed by another agent.

court
type: ObjectProperty
range: Organization
description annot: Public description take from: http://bibotools.googlecode.com/svn/bibo-ontology/trunk/doc/index.html. Bibo considers this property "unstable".
domain: LegalDocument
comment: A court associated with a legal document; for example, that which issues a decision.
term status: unstable

interviewer
type: ObjectProperty
comment: An agent that interview another agent.
sub property of: contributor
term status: stable
range: Agent

translationOf
type: ObjectProperty
inverse of: hasTranslation
comment: Relates a translated document to the original document.
term status: stable
sub property of: isVersionOf
description annot: Examples shows a book has French language version. Public description source: http://bibotools.googlecode.com/svn/bibo-ontology/trunk/doc/index.html .

status
type: ObjectProperty
range: DocumentStatus
description annot: paraphrased editorial note from the bibo ontology: We are not defining, using an enumeration, the range of the bibo:status to be a defined list of bibo:DocumentStatus. This is because we want people to be able to define new statuses if needed; and creating such an enumeration would prevent this.
domain: Document

transcriptOf
type: ObjectProperty
term status: unstable
sub property of: relation
domain: Document
description annot: The bibo:transcriptOf public description was found here: http://bibotools.googlecode.com/svn/bibo-ontology/trunk/doc/index.html . Bibo considers this term unstable.
comment: Relates a document to some transcribed original.

reviewOf
type: ObjectProperty
sub property of: relation
description annot: The bibo:reviewOf public description was found here: http://bibotools.googlecode.com/svn/bibo-ontology/trunk/doc/index.html . As of 26 May 2010, bibo:reviewOf is used with the class Review, but core:reviewIn doesn't seem to be being used.
inverse of: reviewedIn
domain: Review

coden
type: DatatypeProperty
term status: stable
comment: An identifier of serials, still in use by libraries, but replaced by ISSN for any new work
description annot: CODEN became particularly common in the scientific community as a citation system for periodicals cited in technical- as well in chemistry-related publications and as a search tool in many bibliographic catalogues. Definition and description came from Wikipedia here: http://en.wikipedia.org/wiki/CODEN

locator
type: DatatypeProperty
domain: Document
term status: stable
description annot: definition from: http://bibotools.googlecode.com/svn/bibo-ontology/trunk/doc/index.html
comment: A description (often numeric) that locates an item within a containing document or collection.

prefixName
type: DatatypeProperty
term status: stable
comment: The prefix of a name
type: FunctionalProperty
example annot: Mr; Ms; Mrs
domain: Person
description annot: http://dictionary.reference.com/browse/prefix

section
type: DatatypeProperty
sub property of: locator
comment: An section number
example: Di Rado, Alicia. 1995. Trekking through college: Classes explore modern society using the world of Star trek. Los Angeles Times, March 15, sec. A, p. 3.
term status: unstable

sici
type: DatatypeProperty
comment: Serial Item and Contribution Identifier
sub property of: identifier
term status: stable
description annot: A sub property of identifier (http://en.wikipedia.org/wiki/SICI).

gtin14
type: DatatypeProperty
comment: Global Trade Item Number 14
description annot: http://en.wikipedia.org/wiki/Global_Trade_Item_Number.
term status: stable
sub property of: identifier

issue
type: DatatypeProperty
description annot: Bibo has the domain of bibo:issue as the class Issue, but an example on their site uses it with Article, referring to the issue number "4"
domain: Article
type: FunctionalProperty

shortDescription
type: DatatypeProperty
scope note: The idea here is that while dcterms:description may involve length descriptions, this for short (two or three word) descriptions that could go in a bibliographic entry.
term status: unstable
comment: A short description of the resource.
sub property of: description

chapter
type: DatatypeProperty
comment: An chapter number
sub property of: locator
description annot: Title of the chapter (this individual) currently should be entered in the individual name (rdfs:label). Title of the book belongs on a separate Book individual related to the chapter via the core:partOf property (or its child property bibo:reproducedIn). The core:title field is deprecated and should no longer be used as of version 1.1 -- we will want to map rdfs:label to dc:title for query or linked data requests in the future
domain: BookSection
term status: unstable

upc
type: DatatypeProperty
sub property of: identifier
term status: stable
description annot: source for public description: http://en.wikipedia.org/wiki/Universal_Product_Code.
comment: Universal Product Code

pmid
type: DatatypeProperty
description annot: The PubMed ID (PMID) identifies a citation record (rather than full-text) in the PubMed database. It is not evidence of compliance with the NIH Public Access Policy, because it does not identify a full-text submission of any kind.
term status: stable
comment: PubMed Identifier
domain: Document
sub property of: identifier

uri
type: DatatypeProperty
description annot: Definition from: http://bibotools.googlecode.com/svn/bibo-ontology/trunk/doc/index.html
range: anyURI
type: FunctionalProperty

isbn13
type: FunctionalProperty
type: DatatypeProperty
description annot: source: http://en.wikipedia.org/wiki/Isbn.
domain: Book
sub property of: identifier

suffixName
type: FunctionalProperty
type: DatatypeProperty
example annot: Jr.; III;; M.D.
domain: Person
term status: stable
comment: The suffix of a name

asin
type: FunctionalProperty
example annot: 020530902X
sub property of: identifier
term status: stable
description annot: Amazon standard identification number. Source: http://en.wikipedia.org/wiki/Amazon_Standard_Identification_Number.
comment: Amazon Standard Identification Number
type: DatatypeProperty

number
type: FunctionalProperty
description annot: Definition from here: http://bibotools.googlecode.com/svn/bibo-ontology/trunk/doc/index.html
domain: Document
type: DatatypeProperty